Target
5-hydroxytryptamine receptor 2C
Ligand
BDBM50321863
Substrate
Meas. Tech.
ChEMBL_642099 (CHEMBL1176403)
Ki
6.3±n/a nM
Citation
 Cummings, DFCanseco, DCSheth, PJohnson, JESchetz, JA Synthesis and structure-affinity relationships of novel small molecule natural product derivatives capable of discriminating between serotonin 5-HT1A, 5-HT2A, 5-HT2C receptor subtypes. Bioorg Med Chem 18:4783-92 (2011)  
Target
Name:
5-hydroxytryptamine receptor 2C
Synonyms:
5-HT-1C 5-HT1C 5-HT2C-INI 5-HTR2C 5-hydroxytryptamine receptor 2C (5-HT-2C) 5HT-1C HTR1C Serotonin (5-HT3) receptor Serotonin Receptor 2C
Type:
G Protein-Coupled Receptor (GPCR)
Mol. Mass.:
51836.79
Organism:
Homo sapiens (Human)
Description:
P28335
Residue:
458
  
Inhibitor
Name:
BDBM50321863
Synonyms:
5-Chloro-2,3-dihydro-indole-1-carboxylic acid [6-(2-methyl-pyridin-3-yloxy)-pyridin-3-yl]-amide CHEMBL59097
Type:
Small organic molecule
Emp. Form.:
C20H17ClN4O2
Mol. Mass.:
380.828
SMILES:
Cc1ncccc1Oc1ccc(NC(=O)N2CCc3cc(Cl)ccc23)cn1
: