Target
Beta-secretase 1
Ligand
BDBM50323494
Substrate
Meas. Tech.
ChEMBL_644781 (CHEMBL1211024)
IC50
180±n/a nM
Citation
 Truong, APProbst, GDAquino, JFang, LBrogley, LSealy, JMHom, RKTucker, JAJohn, VTung, JSPleiss, MAKonradi, AWSham, HLDappen, MSTóth, GYao, NBrecht, EPan, HArtis, DRRuslim, LBova, MPSinha, SYednock, TAZmolek, WQuinn, KPSauer, JM Improving the permeability of the hydroxyethylamine BACE-1 inhibitors: structure-activity relationship of P2' substituents. Bioorg Med Chem Lett 20:4789-94 (2010)  
Target
Name:
Beta-secretase 1
Synonyms:
ASP2 Aspartyl protease 2 BACE1 Beta-secretase (BACE) Beta-secretase 1 (BACE 1) Beta-secretase 1 (BACE1) Beta-site amyloid precursor protein cleaving enzyme 1 Memapsin-2 beta-Secretase (BACE-1) | beta-Secretase (BACE1)
Type:
Protein
Mol. Mass.:
55755.10
Organism:
Homo sapiens (Human)
Description:
P56817
Residue:
501
  
Inhibitor
Name:
BDBM50323494
Synonyms:
CHEMBL1209105 | N-((2S,3R)-1-(3,5-difluorophenyl)-3-hydroxy-4-(1-(3-(tetrahydrofuran-2-yl)phenyl)cyclohexylamino)butan-2-yl)acetamide
Type:
Small organic molecule
Emp. Form.:
C28H36F2N2O3
Mol. Mass.:
486.5938
SMILES:
CC(=O)N[C@@H](Cc1cc(F)cc(F)c1)[C@H](O)CNC1(CCCCC1)c1cccc(c1)C1CCCO1
: