Target
Indoleamine 2,3-dioxygenase 1
Ligand
BDBM50325542
Substrate
Meas. Tech.
ChEMBL_652246 (CHEMBL1225449)
IC50
19000±n/a nM
Citation
 Matsuno, KTakai, KIsaka, YUnno, YSato, MTakikawa, OAsai, A S-benzylisothiourea derivatives as small-molecule inhibitors of indoleamine-2,3-dioxygenase. Bioorg Med Chem Lett 20:5126-9 (2010)  
Target
Name:
Indoleamine 2,3-dioxygenase 1
Synonyms:
I23O1_HUMAN IDO-1 INDO Indoleamine 2,3-dioxygenase | Indoleamine-pyrrole 2,3-dioxygenase
Type:
Enzyme
Mol. Mass.:
45330.80
Organism:
Homo sapiens (Human)
Description:
P14902
Residue:
403
  
Inhibitor
Name:
BDBM50325542
Synonyms:
CHEMBL1224395 | S-(4-Cyanobenzyl)isothiourea hydrobromide
Type:
Small organic molecule
Emp. Form.:
C9H9N3S
Mol. Mass.:
191.253
SMILES:
NC(=N)SCc1ccc(cc1)C#N
: