Target
Indoleamine 2,3-dioxygenase 1
Ligand
BDBM50325569
Substrate
Meas. Tech.
ChEMBL_652246 (CHEMBL1225449)
IC50
1400±n/a nM
Citation
 Matsuno, KTakai, KIsaka, YUnno, YSato, MTakikawa, OAsai, A S-benzylisothiourea derivatives as small-molecule inhibitors of indoleamine-2,3-dioxygenase. Bioorg Med Chem Lett 20:5126-9 (2010)  
Target
Name:
Indoleamine 2,3-dioxygenase 1
Synonyms:
I23O1_HUMAN IDO-1 INDO Indoleamine 2,3-dioxygenase | Indoleamine-pyrrole 2,3-dioxygenase
Type:
Enzyme
Mol. Mass.:
45330.80
Organism:
Homo sapiens (Human)
Description:
P14902
Residue:
403
  
Inhibitor
Name:
BDBM50325569
Synonyms:
4-Methoxybenzenemethanethiol | CHEMBL1224560
Type:
Small organic molecule
Emp. Form.:
C8H10OS
Mol. Mass.:
154.229
SMILES:
COc1ccc(CS)cc1
: