Target
Indoleamine 2,3-dioxygenase 1
Ligand
BDBM50325571
Substrate
Meas. Tech.
ChEMBL_652246 (CHEMBL1225449)
IC50
100±n/a nM
Citation
 Matsuno, KTakai, KIsaka, YUnno, YSato, MTakikawa, OAsai, A S-benzylisothiourea derivatives as small-molecule inhibitors of indoleamine-2,3-dioxygenase. Bioorg Med Chem Lett 20:5126-9 (2010)  
Target
Name:
Indoleamine 2,3-dioxygenase 1
Synonyms:
I23O1_HUMAN IDO-1 INDO Indoleamine 2,3-dioxygenase | Indoleamine-pyrrole 2,3-dioxygenase
Type:
Enzyme
Mol. Mass.:
45330.80
Organism:
Homo sapiens (Human)
Description:
P14902
Residue:
403
  
Inhibitor
Name:
BDBM50325571
Synonyms:
3,4-Dichlorobenzenemethanethiol | CHEMBL1224626
Type:
Small organic molecule
Emp. Form.:
C7H6Cl2S
Mol. Mass.:
193.094
SMILES:
SCc1ccc(Cl)c(Cl)c1
: