Target
Indoleamine 2,3-dioxygenase 1
Ligand
BDBM50325546
Substrate
Meas. Tech.
ChEMBL_652247 (CHEMBL1225450)
IC50
2200±n/a nM
Citation
 Matsuno, KTakai, KIsaka, YUnno, YSato, MTakikawa, OAsai, A S-benzylisothiourea derivatives as small-molecule inhibitors of indoleamine-2,3-dioxygenase. Bioorg Med Chem Lett 20:5126-9 (2010)  
Target
Name:
Indoleamine 2,3-dioxygenase 1
Synonyms:
I23O1_HUMAN IDO-1 INDO Indoleamine 2,3-dioxygenase | Indoleamine-pyrrole 2,3-dioxygenase
Type:
Enzyme
Mol. Mass.:
45330.80
Organism:
Homo sapiens (Human)
Description:
P14902
Residue:
403
  
Inhibitor
Name:
BDBM50325546
Synonyms:
CHEMBL1224396 | S-(4-Nitrobenzyl)isothiourea hydrochloride
Type:
Small organic molecule
Emp. Form.:
C8H9N3O2S
Mol. Mass.:
211.241
SMILES:
NC(=N)SCc1ccc(cc1)[N+]([O-])=O
: