Target
Indoleamine 2,3-dioxygenase 1
Ligand
BDBM50262752
Substrate
Meas. Tech.
ChEMBL_652247 (CHEMBL1225450)
IC50
>20000±n/a nM
Citation
 Matsuno, KTakai, KIsaka, YUnno, YSato, MTakikawa, OAsai, A S-benzylisothiourea derivatives as small-molecule inhibitors of indoleamine-2,3-dioxygenase. Bioorg Med Chem Lett 20:5126-9 (2010)  
Target
Name:
Indoleamine 2,3-dioxygenase 1
Synonyms:
I23O1_HUMAN IDO-1 INDO Indoleamine 2,3-dioxygenase | Indoleamine-pyrrole 2,3-dioxygenase
Type:
Enzyme
Mol. Mass.:
45330.80
Organism:
Homo sapiens (Human)
Description:
P14902
Residue:
403
  
Inhibitor
Name:
BDBM50262752
Synonyms:
2-(4-chlorophenyl)ethylamine CHEMBL477764
Type:
Small organic molecule
Emp. Form.:
C8H10ClN
Mol. Mass.:
155.625
SMILES:
NCCc1ccc(Cl)cc1
: