Target
Indoleamine 2,3-dioxygenase 1
Ligand
BDBM50325541
Substrate
Meas. Tech.
ChEMBL_652246 (CHEMBL1225449)
IC50
400±n/a nM
Citation
 Matsuno, KTakai, KIsaka, YUnno, YSato, MTakikawa, OAsai, A S-benzylisothiourea derivatives as small-molecule inhibitors of indoleamine-2,3-dioxygenase. Bioorg Med Chem Lett 20:5126-9 (2010)  
Target
Name:
Indoleamine 2,3-dioxygenase 1
Synonyms:
I23O1_HUMAN IDO-1 INDO Indoleamine 2,3-dioxygenase | Indoleamine-pyrrole 2,3-dioxygenase
Type:
Enzyme
Mol. Mass.:
45330.80
Organism:
Homo sapiens (Human)
Description:
P14902
Residue:
403
  
Inhibitor
Name:
BDBM50325541
Synonyms:
CHEMBL1224483 S-(2,4-Dichlorobenzyl)isothiourea hydrobromide | cid_15945669
Type:
Small organic molecule
Emp. Form.:
C8H8Cl2N2S
Mol. Mass.:
235.134
SMILES:
NC(=N)SCc1ccc(Cl)cc1Cl
: