Target
Serine-protein kinase ATM
Ligand
BDBM50208517
Substrate
Meas. Tech.
ChEMBL_660433 (CHEMBL1250023)
Ki
2.2±n/a nM
Citation
 Knight, ZAShokat, KM Features of selective kinase inhibitors. Chem Biol 12:621-37 (2005)  
Target
Name:
Serine-protein kinase ATM
Synonyms:
A-T mutated ATM_HUMAN | Ataxia telangiectasia mutated
Type:
Protein
Mol. Mass.:
350696.72
Organism:
Homo sapiens (Human)
Description:
Q13315
Residue:
3056
  
Inhibitor
Name:
BDBM50208517
Synonyms:
2-morpholin-4-yl-6-thianthren-1-yl-pyran-4-one KU-55933
Type:
Small organic molecule
Emp. Form.:
C21H17NO3S2
Mol. Mass.:
395.495
SMILES:
O=c1cc(oc(c1)-c1cccc2Sc3ccccc3Sc12)N1CCOCC1
: