Target
Motilin receptor
Ligand
BDBM50344942
Substrate
Meas. Tech.
ChEMBL_664665 (CHEMBL1260551)
EC50
1200±n/a nM
Citation
 Liu, YLi, YChen, YZheng, HClaypool, MMyles, DCCarreras, CW 9-Dihydroerythromycins as non-antibiotic motilin receptor agonists. Bioorg Med Chem Lett 20:5658-61 (2010)  
Target
Name:
Motilin receptor
Synonyms:
Type:
Mol. Mass.:
43771.25
Organism:
Oryctolagus cuniculus
Description:
Residue:
400
  
Inhibitor
Name:
BDBM50344942
Synonyms:
CHEMBL532 ERYTHROMYCIN Erycette Erythromycin A Ilotycin | T-Stat
Type:
Small organic molecule
Emp. Form.:
C37H67NO13
Mol. Mass.:
733.9268
SMILES:
CC[C@H]1OC(=O)[C@H](C)[C@@H](O[C@H]2C[C@@](C)(OC)[C@@H](O)[C@H](C)O2)[C@H](C)[C@@H](O[C@@H]2O[C@H](C)C[C@@H]([C@H]2O)N(C)C)[C@](C)(O)C[C@@H](C)C(=O)[C@H](C)[C@@H](O)[C@]1(C)O
: