Target
Mu-type opioid receptor
Ligand
BDBM50334991
Substrate
Meas. Tech.
ChEMBL_702693 (CHEMBL1657629)
Ki
0.390000±n/a nM
Citation
 Cowell, SMHanlon, KE Development of potent µ and d opioid agonists with high lipophilicity. J Med Chem 54:382-6 (2011)  
Target
Name:
Mu-type opioid receptor
Synonyms:
MOR-1 Mu-type opioid receptor (MOR) OPRM_RAT Opioid receptor B Ror-b
Type:
G Protein-Coupled Receptor (GPCR)
Mol. Mass.:
44503.11
Organism:
Rattus norvegicus (rat)
Description:
Competition binding assays were carried out using membrane preparations from transfected HN9.10 cells that constitutively expressed the mu opioid receptor.
Residue:
398
  
Inhibitor
Name:
BDBM50334991
Synonyms:
(R)-2-((S)-2-amino-3-(4-hydroxy-2,6-dimethylphenyl)propanamido)-N-(2-oxo-2-((S)-1-oxo-3-phenyl-1-(4-(N-phenylpropionamido)piperidin-1-yl)propan-2-ylamino)ethyl)hexanamide | CHEMBL1649938
Type:
Small organic molecule
Emp. Form.:
C42H56N6O6
Mol. Mass.:
740.9306
SMILES:
CCCC[C@@H](NC(=O)[C@@H](N)Cc1c(C)cc(O)cc1C)C(=O)NCC(=O)N[C@@H](Cc1ccccc1)C(=O)N1CCC(CC1)N(C(=O)CC)c1ccccc1
: