Target
Delta-type opioid receptor
Ligand
BDBM50334988
Substrate
Meas. Tech.
ChEMBL_702698 (CHEMBL1657772)
IC50
1.8±n/a nM
Citation
 Cowell, SMHanlon, KE Development of potent µ and d opioid agonists with high lipophilicity. J Med Chem 54:382-6 (2011)  
Target
Name:
Delta-type opioid receptor
Synonyms:
DOR-1 MSL-2 OPRD_MOUSE Oprd1
Type:
Enzyme Catalytic Domain
Mol. Mass.:
40577.25
Organism:
MOUSE
Description:
P32300
Residue:
372
  
Inhibitor
Name:
BDBM50334988
Synonyms:
(S)-2-amino-N-((R)-1-(2-((S)-3-(4-fluorophenyl)-1-oxo-1-(4-(N-phenylpropionamido)piperidin-1-yl)propan-2-ylamino)-2-oxoethylamino)-1-oxopropan-2-yl)-3-(4-hydroxy-2,6-dimethylphenyl)propanamide | CHEMBL1649946
Type:
Small organic molecule
Emp. Form.:
C39H49FN6O6
Mol. Mass.:
716.8414
SMILES:
CCC(=O)N(C1CCN(CC1)C(=O)[C@H](Cc1ccc(F)cc1)NC(=O)CNC(=O)[C@@H](C)NC(=O)[C@@H](N)Cc1c(C)cc(O)cc1C)c1ccccc1
: