Target
Outer membrane protein MIP
Ligand
BDBM50335230
Substrate
Meas. Tech.
ChEMBL_701873 (CHEMBL1657165)
IC50
>100000±n/a nM
Citation
 Juli, CSippel, MJäger, JThiele, AWeiwad, MSchweimer, KRösch, PSteinert, MSotriffer, CAHolzgrabe, U Pipecolic acid derivatives as small-molecule inhibitors of the Legionella MIP protein. J Med Chem 54:277-83 (2011)  
Target
Name:
Outer membrane protein MIP
Synonyms:
MIP_LEGPN PPIase Rotamase | mip
Type:
PROTEIN
Mol. Mass.:
24869.94
Organism:
Legionella pneumophila
Description:
ChEMBL_701873
Residue:
233
  
Inhibitor
Name:
BDBM50335230
Synonyms:
3-(3,4,5-trimethoxyphenyl)propyl 1-(3-aminophenylsulfonyl)piperidine-2-carboxylate | CHEMBL1650943
Type:
Small organic molecule
Emp. Form.:
C24H32N2O7S
Mol. Mass.:
492.585
SMILES:
COc1cc(CCCOC(=O)C2CCCCN2S(=O)(=O)c2cccc(N)c2)cc(OC)c1OC
: