Target
Peptidyl-prolyl cis-trans isomerase FKBP1A
Ligand
BDBM50335224
Substrate
Meas. Tech.
ChEMBL_701874 (CHEMBL1657166)
IC50
200±n/a nM
Citation
 Juli, CSippel, MJäger, JThiele, AWeiwad, MSchweimer, KRösch, PSteinert, MSotriffer, CAHolzgrabe, U Pipecolic acid derivatives as small-molecule inhibitors of the Legionella MIP protein. J Med Chem 54:277-83 (2011)  
Target
Name:
Peptidyl-prolyl cis-trans isomerase FKBP1A
Synonyms:
12 kDa FK506-binding protein FK506-binding protein 1A FKB1A_HUMAN FKBP-1A FKBP12 Immunophilin FKBP12 PPIase FKBP1A Rotamase mTOR/FKBP12A/FKBP12B
Type:
Isomerase
Mol. Mass.:
11953.09
Organism:
Homo sapiens (Human)
Description:
P62942
Residue:
108
  
Inhibitor
Name:
BDBM50335224
Synonyms:
CHEMBL1650946 | rac-3-(3,4,5-trimethoxyphenyl)propyl 1-(benzylsulfonyl)piperidine-2-carboxylate
Type:
Small organic molecule
Emp. Form.:
C25H33NO7S
Mol. Mass.:
491.597
SMILES:
COc1cc(CCCOC(=O)C2CCCCN2S(=O)(=O)Cc2ccccc2)cc(OC)c1OC
: