Target
Peptidyl-prolyl cis-trans isomerase FKBP1A
Ligand
BDBM50335227
Substrate
Meas. Tech.
ChEMBL_701874 (CHEMBL1657166)
IC50
150±n/a nM
Citation
 Juli, CSippel, MJäger, JThiele, AWeiwad, MSchweimer, KRösch, PSteinert, MSotriffer, CAHolzgrabe, U Pipecolic acid derivatives as small-molecule inhibitors of the Legionella MIP protein. J Med Chem 54:277-83 (2011)  
Target
Name:
Peptidyl-prolyl cis-trans isomerase FKBP1A
Synonyms:
12 kDa FK506-binding protein FK506-binding protein 1A FKB1A_HUMAN FKBP-1A FKBP12 Immunophilin FKBP12 PPIase FKBP1A Rotamase mTOR/FKBP12A/FKBP12B
Type:
Isomerase
Mol. Mass.:
11953.09
Organism:
Homo sapiens (Human)
Description:
P62942
Residue:
108
  
Inhibitor
Name:
BDBM50335227
Synonyms:
3-(pyridin-3-yl)propyl 1-(3-nitrophenylsulfonyl)piperidine-2-carboxylate | CHEMBL1650948
Type:
Small organic molecule
Emp. Form.:
C20H23N3O6S
Mol. Mass.:
433.478
SMILES:
[O-][N+](=O)c1cccc(c1)S(=O)(=O)N1CCCCC1C(=O)OCCCc1cccnc1
: