Target
Bifunctional epoxide hydrolase 2
Ligand
BDBM50417985
Substrate
Meas. Tech.
ChEMBL_718702 (CHEMBL1680921)
IC50
19.95±n/a nM
Citation
 Tanaka, DTsuda, YShiyama, TNishimura, TChiyo, NTominaga, YSawada, NMimoto, TKusunose, N A practical use of ligand efficiency indices out of the fragment-based approach: ligand efficiency-guided lead identification of soluble epoxide hydrolase inhibitors. J Med Chem 54:851-7 (2012)  
Target
Name:
Bifunctional epoxide hydrolase 2
Synonyms:
Ephx2 HYES_RAT
Type:
PROTEIN
Mol. Mass.:
62337.15
Organism:
Rattus norvegicus
Description:
ChEMBL_1465995
Residue:
554
  
Inhibitor
Name:
BDBM50417985
Synonyms:
CHEMBL1672130
Type:
Small organic molecule
Emp. Form.:
C18H17N3O2
Mol. Mass.:
307.3465
SMILES:
Cc1nc2cc(NC(=O)N[C@H]3C[C@@H]3c3ccccc3)ccc2o1
: