Target
Acetylcholinesterase
Ligand
BDBM10584
Substrate
Meas. Tech.
ChEMBL_811246 (CHEMBL2015198)
IC50
1.9±n/a nM
Citation
 Galdeano, CViayna, ESola, IFormosa, XCamps, PBadia, AClos, MVRelat, JRatia, MBartolini, MMancini, FAndrisano, VSalmona, MMinguillón, CGonzález-Muñoz, GCRodríguez-Franco, MIBidon-Chanal, ALuque, FJMuñoz-Torrero, D Huprine-tacrine heterodimers as anti-amyloidogenic compounds of potential interest against Alzheimer's and prion diseases. J Med Chem 55:661-9 (2012)  
Target
Name:
Acetylcholinesterase
Synonyms:
ACES_HUMAN Acetylcholinesterase (AChE) | Acetylcholinesterase (human AChE)
Type:
Enzyme
Mol. Mass.:
67792.70
Organism:
Homo sapiens (Human)
Description:
P22303
Residue:
614
  
Inhibitor
Name:
BDBM10584
Synonyms:
3-Chloro-6,7,10,11-tetrahydro-9-methyl-12-{{7-[(1,2,3,4-tetrahydroacridin-9-yl)amino]heptyl}amino}-7,11-methanocycloocta[b]quinoline dihydrochloride CHEMBL2011484 | Huprine-Tacrine Heterodimer 17b
Type:
Small organic molecule
Emp. Form.:
C37H43ClN4
Mol. Mass.:
579.217
SMILES:
CC1=CC2CC(C1)c1c(C2)nc2cc(Cl)ccc2c1NCCCCCCCNc1c2CCCCc2nc2ccccc12
: