Target
Acetylcholinesterase
Ligand
BDBM50200340
Substrate
Meas. Tech.
ChEMBL_811246 (CHEMBL2015198)
IC50
0.690000±n/a nM
Citation
 Galdeano, CViayna, ESola, IFormosa, XCamps, PBadia, AClos, MVRelat, JRatia, MBartolini, MMancini, FAndrisano, VSalmona, MMinguillón, CGonzález-Muñoz, GCRodríguez-Franco, MIBidon-Chanal, ALuque, FJMuñoz-Torrero, D Huprine-tacrine heterodimers as anti-amyloidogenic compounds of potential interest against Alzheimer's and prion diseases. J Med Chem 55:661-9 (2012)  
Target
Name:
Acetylcholinesterase
Synonyms:
ACES_HUMAN Acetylcholinesterase (AChE) | Acetylcholinesterase (human AChE)
Type:
Enzyme
Mol. Mass.:
67792.70
Organism:
Homo sapiens (Human)
Description:
P22303
Residue:
614
  
Inhibitor
Name:
BDBM50200340
Synonyms:
(+/-)-huprine Y-HCl CHEMBL536047
Type:
Small organic molecule
Emp. Form.:
C17H17ClN2
Mol. Mass.:
284.783
SMILES:
CC1=CC2CC(C1)c1c(C2)nc2cc(Cl)ccc2c1N
: