Target
Indoleamine 2,3-dioxygenase 1
Ligand
BDBM50379307
Substrate
Meas. Tech.
ChEMBL_811966 (CHEMBL2013336)
Ki
635000±n/a nM
Citation
 Cebrián-Torrejón, GAssad Kahn, SLagarde, NCastellano, FLeblanc, KRodrigo, JMolinier-Frenkel, VRojas de Arias, AFerreira, METhirant, CFournet, AFigadère, BChneiweiss, HPoupon, E Antiproliferative activity of trans-avicennol from Zanthoxylum chiloperone var. angustifolium against human cancer stem cells. J Nat Prod 75:257-61 (2012)  
Target
Name:
Indoleamine 2,3-dioxygenase 1
Synonyms:
I23O1_HUMAN IDO-1 INDO Indoleamine 2,3-dioxygenase | Indoleamine-pyrrole 2,3-dioxygenase
Type:
Enzyme
Mol. Mass.:
45330.80
Organism:
Homo sapiens (Human)
Description:
P14902
Residue:
403
  
Inhibitor
Name:
BDBM50379307
Synonyms:
AVICENNOL
Type:
Small organic molecule
Emp. Form.:
C20H22O5
Mol. Mass.:
342.3857
SMILES:
COc1c2C=CC(C)(C)Oc2c2ccc(=O)oc2c1\C=C\C(C)(C)O
: