Target
Sodium channel protein type 9 subunit alpha
Ligand
BDBM50379465
Substrate
Meas. Tech.
ChEMBL_812132 (CHEMBL2013636)
IC50
300±n/a nM
Citation
 Chakka, NBregman, HDu, BNguyen, HNBuchanan, JLFeric, ELigutti, JLiu, DMcDermott, JSZou, AMcDonough, SIDimauro, EF Discovery and hit-to-lead optimization of pyrrolopyrimidines as potent, state-dependent Na(v)1.7 antagonists. Bioorg Med Chem Lett 22:2052-62 (2012)  
Target
Name:
Sodium channel protein type 9 subunit alpha
Synonyms:
NENA Peripheral sodium channel 1 SCN9A_HUMAN Voltage-gated sodium channel subunit Nav1.7 hNE-Na
Type:
Protein
Mol. Mass.:
226375.97
Organism:
Homo sapiens (Human)
Description:
Q15858
Residue:
1988
  
Inhibitor
Name:
BDBM50379465
Synonyms:
CHEMBL2012291
Type:
Small organic molecule
Emp. Form.:
C25H27N5O
Mol. Mass.:
413.5148
SMILES:
Cc1ccc(CN2CCC(CC2)Oc2ncnc3n(Cc4ccccc4)ccc23)nc1
: