Target
Peroxisome proliferator-activated receptor alpha
Ligand
BDBM50379798
Substrate
Meas. Tech.
ChEMBL_812493 (CHEMBL2014329)
EC50
53200±n/a nM
Citation
 Quang, THNgan, NTMinh, CVKiem, PVTai, BHThao, NPSong, SBKim, YH Anti-inflammatory and PPAR transactivational effects of secondary metabolites from the roots of Asarum sieboldii. Bioorg Med Chem Lett 22:2527-33 (2012)  
Target
Name:
Peroxisome proliferator-activated receptor alpha
Synonyms:
NR1C1 PPAR PPAR-alpha PPARA_HUMAN Peroxisome proliferator-activated receptor | Peroxisome proliferator-activated receptor alpha (PPAR alpha)
Type:
Enzyme
Mol. Mass.:
52222.08
Organism:
Homo sapiens (Human)
Description:
Q07869
Residue:
468
  
Inhibitor
Name:
BDBM50379798
Synonyms:
PIPERITOL
Type:
Small organic molecule
Emp. Form.:
C20H20O6
Mol. Mass.:
356.3692
SMILES:
COc1cc(ccc1O)[C@@H]1OC[C@@H]2[C@H]1CO[C@H]2c1ccc2OCOc2c1
: