Target
Peroxisome proliferator-activated receptor delta
Ligand
BDBM50379798
Substrate
Meas. Tech.
ChEMBL_809686 (CHEMBL2015997)
EC50
33900±n/a nM
Citation
 Quang, THNgan, NTMinh, CVKiem, PVTai, BHThao, NPSong, SBKim, YH Anti-inflammatory and PPAR transactivational effects of secondary metabolites from the roots of Asarum sieboldii. Bioorg Med Chem Lett 22:2527-33 (2012)  
Target
Name:
Peroxisome proliferator-activated receptor delta
Synonyms:
NR1C2 NUCI Nuclear receptor subfamily 1 group C member 2 PPAR-beta PPARD Peroxisome proliferator-activated receptor Peroxisome proliferator-activated receptor delta
Type:
Enzyme
Mol. Mass.:
49910.45
Organism:
Homo sapiens (Human)
Description:
Q03181
Residue:
441
  
Inhibitor
Name:
BDBM50379798
Synonyms:
PIPERITOL
Type:
Small organic molecule
Emp. Form.:
C20H20O6
Mol. Mass.:
356.3692
SMILES:
COc1cc(ccc1O)[C@@H]1OC[C@@H]2[C@H]1CO[C@H]2c1ccc2OCOc2c1
: