Target
cAMP-specific 3',5'-cyclic phosphodiesterase 4B
Ligand
BDBM50379979
Substrate
Meas. Tech.
ChEMBL_810011 (CHEMBL2015120)
IC50
0.03±n/a nM
Citation
 Kuang, RShue, HJXiao, LBlythin, DJShih, NYChen, XGu, DSchwerdt, JLin, LTing, PCCao, JAslanian, RPiwinski, JJPrelusky, DWu, PZhang, JZhang, XCelly, CSBillah, MWang, P Discovery of oxazole-based PDE4 inhibitors with picomolar potency. Bioorg Med Chem Lett 22:2594-7 (2012)  
Target
Name:
cAMP-specific 3',5'-cyclic phosphodiesterase 4B
Synonyms:
3',5'-cyclic phosphodiesterase Isoform PDE4B1 PDE4B PDE4B_HUMAN Phosphodiesterase 4B (PDE4B) Phosphodiesterase Type 4 (PDE4B)
Type:
Protein
Mol. Mass.:
83318.87
Organism:
Homo sapiens (Human)
Description:
Q07343
Residue:
736
  
Inhibitor
Name:
BDBM50379979
Synonyms:
CHEMBL2012227
Type:
Small organic molecule
Emp. Form.:
C24H19ClF4N4O3
Mol. Mass.:
522.879
SMILES:
COc1ccc(-c2nc(C(=O)NCc3c(F)cccc3Cl)c(o2)[C@H](C)N)c2ccc(nc12)C(F)(F)F
: