Target
Neuronal acetylcholine receptor subunit alpha-3/beta-4
Ligand
BDBM50380100
Substrate
Meas. Tech.
ChEMBL_811177 (CHEMBL2014882)
Ki
>10000±n/a nM
Citation
 Beinat, CBanister, SDvan Prehn, SDoddareddy, MRHibbs, DSako, MChebib, MTran, TAl-Muhtasib, NXiao, YKassiou, M Consequences of linker length alteration of thea7 nicotinic acetylcholine receptor (nAChR) agonist, SEN12333. Bioorg Med Chem Lett 22:2380-4 (2012)  
Target
Name:
Neuronal acetylcholine receptor subunit alpha-3/beta-4
Synonyms:
Neuronal acetylcholine receptor Alpha-3/Beta-4 Neuronal acetylcholine receptor; alpha3/beta4 | nAChR subtypes alpha3 beta4
Type:
Protein
Mol. Mass.:
Description:
Components:
This complex has 2 components.
Component 1
Name:
Neuronal acetylcholine receptor subunit alpha-3
Synonyms:
ACHA3_RAT Chrna3
Type:
Enzyme
Mol. Mass.:
56995.52
Organism:
Rattus norvegicus (Rat)
Description:
P04757
Residue:
499
  
Component 2
Name:
Neuronal acetylcholine receptor subunit beta-4
Synonyms:
ACHB4_RAT Chrnb4 Neuronal acetylcholine receptor non-alpha-2 chain | Neuronal acetylcholine receptor protein beta-4 subunit
Type:
Enzyme
Mol. Mass.:
55863.89
Organism:
Rattus norvegicus (Rat)
Description:
P12392
Residue:
495
  
Inhibitor
Name:
BDBM50380100
Synonyms:
CHEMBL2012937
Type:
Small organic molecule
Emp. Form.:
C21H27N3O2
Mol. Mass.:
353.458
SMILES:
O=C(CCCCCN1CCOCC1)Nc1ccc(cc1)-c1cccnc1
: