Target
Neuronal acetylcholine receptor subunit alpha-7
Ligand
BDBM50380098
Substrate
Meas. Tech.
ChEMBL_811178 (CHEMBL2014883)
Ki
>10000±n/a nM
Citation
 Beinat, CBanister, SDvan Prehn, SDoddareddy, MRHibbs, DSako, MChebib, MTran, TAl-Muhtasib, NXiao, YKassiou, M Consequences of linker length alteration of thea7 nicotinic acetylcholine receptor (nAChR) agonist, SEN12333. Bioorg Med Chem Lett 22:2380-4 (2012)  
Target
Name:
Neuronal acetylcholine receptor subunit alpha-7
Synonyms:
ACHA7_RAT Cholinergic, Nicotinic Alpha7 Chrna7 Neuronal acetylcholine receptor (alpha7 nAChR) Neuronal acetylcholine receptor subunit alpha-7 Neuronal acetylcholine receptor subunit alpha-7 (nAChR)
Type:
Enzyme
Mol. Mass.:
56502.44
Organism:
Rattus norvegicus (Rat)
Description:
Q05941
Residue:
502
  
Inhibitor
Name:
BDBM50380098
Synonyms:
CHEMBL2010825
Type:
Small organic molecule
Emp. Form.:
C18H21N3O2
Mol. Mass.:
311.3782
SMILES:
O=C(CCN1CCOCC1)Nc1ccc(cc1)-c1cccnc1
: