Target
Neuronal acetylcholine receptor subunit alpha-7
Ligand
BDBM50300811
Substrate
Meas. Tech.
ChEMBL_811178 (CHEMBL2014883)
EC50
2840±n/a nM
Citation
 Beinat, CBanister, SDvan Prehn, SDoddareddy, MRHibbs, DSako, MChebib, MTran, TAl-Muhtasib, NXiao, YKassiou, M Consequences of linker length alteration of thea7 nicotinic acetylcholine receptor (nAChR) agonist, SEN12333. Bioorg Med Chem Lett 22:2380-4 (2012)  
Target
Name:
Neuronal acetylcholine receptor subunit alpha-7
Synonyms:
ACHA7_RAT Cholinergic, Nicotinic Alpha7 Chrna7 Neuronal acetylcholine receptor (alpha7 nAChR) Neuronal acetylcholine receptor subunit alpha-7 Neuronal acetylcholine receptor subunit alpha-7 (nAChR)
Type:
Enzyme
Mol. Mass.:
56502.44
Organism:
Rattus norvegicus (Rat)
Description:
Q05941
Residue:
502
  
Inhibitor
Name:
BDBM50300811
Synonyms:
CHEMBL576234 | N-{4-[4-(2,4-dimethoxyphenyl)-piperazin-1-yl]butyl}-4-pyridin-2-ylbenzamide
Type:
Small organic molecule
Emp. Form.:
C28H34N4O3
Mol. Mass.:
474.5946
SMILES:
COc1ccc(N2CCN(CCCCNC(=O)c3ccc(cc3)-c3ccccn3)CC2)c(OC)c1
: