Target
Cytochrome P450 2D6
Ligand
BDBM50380508
Substrate
Meas. Tech.
ChEMBL_813103 (CHEMBL2020722)
IC50
20±n/a nM
Citation
 Foti, RSRock, DAHan, XFlowers, RAWienkers, LCWahlstrom, JL Ligand-based design of a potent and selective inhibitor of cytochrome P450 2C19. J Med Chem 55:1205-14 (2012)  
Target
Name:
Cytochrome P450 2D6
Synonyms:
CP2D6_HUMAN CYP2DL1 Cytochrome P450 2D6 (CYP2D6) P450-DB1
Type:
Protein
Mol. Mass.:
55774.82
Organism:
Homo sapiens (Human)
Description:
P10635
Residue:
497
  
Inhibitor
Name:
BDBM50380508
Synonyms:
CHEMBL2018923
Type:
Small organic molecule
Emp. Form.:
C21H18N2OS
Mol. Mass.:
346.445
SMILES:
COc1ccc2nc(SCc3cccc(c3)-c3ccccc3)[nH]c2c1
: