Target
Cytochrome P450 1A2
Ligand
BDBM50380522
Substrate
Meas. Tech.
ChEMBL_813098 (CHEMBL2020672)
IC50
390±n/a nM
Citation
 Foti, RSRock, DAHan, XFlowers, RAWienkers, LCWahlstrom, JL Ligand-based design of a potent and selective inhibitor of cytochrome P450 2C19. J Med Chem 55:1205-14 (2012)  
Target
Name:
Cytochrome P450 1A2
Synonyms:
CP1A2_HUMAN CYPIA2 Cytochrome P(3)450 Cytochrome P450 1A2 (CYP1A2) Cytochrome P450-P3
Type:
Enzyme
Mol. Mass.:
58423.38
Organism:
Homo sapiens (Human)
Description:
P05177
Residue:
516
  
Inhibitor
Name:
BDBM50380522
Synonyms:
CHEMBL2018907
Type:
Small organic molecule
Emp. Form.:
C14H20N2OS
Mol. Mass.:
264.386
SMILES:
CCCCCCSc1nc2ccc(OC)cc2[nH]1
: