Target
Cytochrome P450 2C19
Ligand
BDBM50275735
Substrate
Meas. Tech.
ChEMBL_813096 (CHEMBL2020670)
Ki
70±n/a nM
Citation
 Foti, RSRock, DAHan, XFlowers, RAWienkers, LCWahlstrom, JL Ligand-based design of a potent and selective inhibitor of cytochrome P450 2C19. J Med Chem 55:1205-14 (2012)  
Target
Name:
Cytochrome P450 2C19
Synonyms:
(R)-limonene 6-monooxygenase (S)-limonene 7-monooxygenase CYP2C19 CYPIIC19 Cytochrome P450 2C19 [I331V] Cytochrome P450-254C Mephenytoin 4-hydroxylase P450-254C
Type:
Enzyme
Mol. Mass.:
55935.47
Organism:
Homo sapiens (Human)
Description:
P33261
Residue:
490
  
Inhibitor
Name:
BDBM50275735
Synonyms:
2-(3,5-dimethoxybenzylthio)-6-methoxy-1H-benzo[d]imidazole | CHEMBL488400
Type:
Small organic molecule
Emp. Form.:
C17H18N2O3S
Mol. Mass.:
330.401
SMILES:
COc1ccc2nc(SCc3cc(OC)cc(OC)c3)[nH]c2c1
: