Target
Acetylcholinesterase
Ligand
BDBM50381149
Substrate
Meas. Tech.
ChEMBL_814273 (CHEMBL2019370)
IC50
2500±n/a nM
Citation
 Chen, YFang, LPeng, SLiao, HLehmann, JZhang, Y Discovery of a novel acetylcholinesterase inhibitor by structure-based virtual screening techniques. Bioorg Med Chem Lett 22:3181-7 (2012)  
Target
Name:
Acetylcholinesterase
Synonyms:
ACES_ELEEL Acetylcholinesterase (EeAChE) | ache
Type:
Enzyme
Mol. Mass.:
71812.79
Organism:
Electrophorus electricus (Electric eel)
Description:
Residue:
633
  
Inhibitor
Name:
BDBM50381149
Synonyms:
CHEMBL2018209
Type:
Small organic molecule
Emp. Form.:
C23H26N4O4S3
Mol. Mass.:
518.672
SMILES:
NS(=O)(=O)c1ccc(NC(=O)CCCSc2nc3sc4CCCCc4c3c(=O)n2CC=C)cc1
: