Target
Acetylcholinesterase
Ligand
BDBM50381151
Substrate
Meas. Tech.
ChEMBL_814273 (CHEMBL2019370)
IC50
6700±n/a nM
Citation
 Chen, YFang, LPeng, SLiao, HLehmann, JZhang, Y Discovery of a novel acetylcholinesterase inhibitor by structure-based virtual screening techniques. Bioorg Med Chem Lett 22:3181-7 (2012)  
Target
Name:
Acetylcholinesterase
Synonyms:
ACES_ELEEL Acetylcholinesterase (EeAChE) | ache
Type:
Enzyme
Mol. Mass.:
71812.79
Organism:
Electrophorus electricus (Electric eel)
Description:
Residue:
633
  
Inhibitor
Name:
BDBM50381151
Synonyms:
CHEMBL2018210
Type:
Small organic molecule
Emp. Form.:
C22H15F5N2O4
Mol. Mass.:
466.3575
SMILES:
COc1cc(\C=N\NC(=O)c2ccc(COc3c(F)c(F)c(F)c(F)c3F)cc2)ccc1O
: