Target
Amine oxidase [flavin-containing] A
Ligand
BDBM50381224
Substrate
Meas. Tech.
ChEMBL_814309 (CHEMBL2019406)
IC50
800±n/a nM
Citation
 Mu, LHWang, BRen, HYLiu, PGuo, DHWang, FMBai, LGuo, YS Synthesis and inhibitory effect of piperine derivates on monoamine oxidase. Bioorg Med Chem Lett 22:3343-8 (2012)  
Target
Name:
Amine oxidase [flavin-containing] A
Synonyms:
AOFA_RAT Amine oxidase [flavin-containing] A Monoamine Oxidase Type A (MAO-A) Monoamine oxidase A (MAO-A) Monoamine oxidase type A (MAOA)
Type:
Enzyme
Mol. Mass.:
59515.21
Organism:
Rattus norvegicus (rat)
Description:
Residue:
526
  
Inhibitor
Name:
BDBM50381224
Synonyms:
CHEMBL2018554
Type:
Small organic molecule
Emp. Form.:
C16H19NO3
Mol. Mass.:
273.327
SMILES:
Oc1ccc(\C=C\C=C\C(=O)N2CCCCC2)cc1O
: