Target
Vascular endothelial growth factor receptor 2
Ligand
BDBM50381711
Substrate
Meas. Tech.
ChEMBL_816380 (CHEMBL2024778)
IC50
25±n/a nM
Citation
 Curtin, MLFrey, RRHeyman, HRSoni, NBMarcotte, PAPease, LJGlaser, KBMagoc, TJTapang, PAlbert, DHOsterling, DJOlson, AMBouska, JJGuan, ZPreusser, LCPolakowski, JSStewart, KDTse, CDavidsen, SKMichaelides, MR Thienopyridine ureas as dual inhibitors of the VEGF and Aurora kinase families. Bioorg Med Chem Lett 22:3208-12 (2012)  
Target
Name:
Vascular endothelial growth factor receptor 2
Synonyms:
CD_antigen=CD309 Fetal liver kinase 1 (FLK-1) KDR Protein-tyrosine kinase receptor Flk-1 VEGFR-2 VEGFR2 Vascular Endothelial Growth Factor Receptor Kinase 2 Vascular endothelial growth factor receptor 2 (KDR) Vascular endothelial growth factor receptor 2 (VEGFR2) Vascular endothelial growth factor receptor-2 (VEGFR-2)
Type:
Receptor Tyrosine Kinase
Mol. Mass.:
151510.97
Organism:
Homo sapiens (Human)
Description:
P35968
Residue:
1356
  
Inhibitor
Name:
BDBM50381711
Synonyms:
CHEMBL2022851
Type:
Small organic molecule
Emp. Form.:
C27H25FN6OS
Mol. Mass.:
500.59
SMILES:
CC(C)Cn1cc(cn1)-c1cnc(N)c2c(csc12)-c1ccc(NC(=O)Nc2cccc(F)c2)cc1
: