Target
Prostaglandin G/H synthase 1
Ligand
BDBM50382208
Substrate
Meas. Tech.
ChEMBL_815719 (CHEMBL2025719)
IC50
>50000±n/a nM
Citation
 El-Sayed, MAAbdel-Aziz, NIAbdel-Aziz, AAEl-Azab, ASElTahir, KE Synthesis, biological evaluation and molecular modeling study of pyrazole and pyrazoline derivatives as selective COX-2 inhibitors and anti-inflammatory agents. Part 2. Bioorg Med Chem 20:3306-16 (2012)  
Target
Name:
Prostaglandin G/H synthase 1
Synonyms:
COX1 Cyclooxygenase-1 (COX-1) PTGS1 | Prostaglandin G/H synthase (cyclooxygenase)
Type:
Protein
Mol. Mass.:
68868.60
Organism:
Ovis aries (Sheep)
Description:
Residue:
600
  
Inhibitor
Name:
BDBM50382208
Synonyms:
CHEMBL2024225
Type:
Small organic molecule
Emp. Form.:
C17H12ClF3N2
Mol. Mass.:
336.739
SMILES:
FC(F)(F)c1[nH]nc(c1Cc1ccccc1)-c1ccc(Cl)cc1
: