Target
Metabotropic glutamate receptor 5
Ligand
BDBM86716
Substrate
Meas. Tech.
ChEMBL_815177 (CHEMBL2025194)
IC50
43±n/a nM
Citation
 Gichinga, MGOlson, JPButala, ENavarro, HAGilmour, BPMascarella, SWCarroll, FI Synthesis and Evaluation of Metabotropic Glutamate Receptor Subtype 5 Antagonists Based on Fenobam(). ACS Med Chem Lett 2:882-884 (2011)  
Target
Name:
Metabotropic glutamate receptor 5
Synonyms:
GPRC1E GRM5_HUMAN metabotropic glutamate 5 | metabotropic glutamate 5a
Type:
Enzyme
Mol. Mass.:
132484.72
Organism:
Homo sapiens (Human)
Description:
Residue:
1212
  
Inhibitor
Name:
BDBM86716
Synonyms:
CAS_63540-28-3 Fenobam | NSC_216215
Type:
Small organic molecule
Emp. Form.:
C11H11ClN4O2
Mol. Mass.:
266.684
SMILES:
Cn1cc(O)nc1NC(=O)Nc1cccc(Cl)c1
: