Target
Insulin-like growth factor 1 receptor
Ligand
BDBM50382663
Substrate
Meas. Tech.
ChEMBL_816744 (CHEMBL2025773)
IC50
>25000±n/a nM
Citation
 Bryan, MCWhittington, DADoherty, EMFalsey, JRCheng, ACEmkey, RBrake, RLLewis, RT Rapid development of piperidine carboxamides as potent and selective anaplastic lymphoma kinase inhibitors. J Med Chem 55:1698-705 (2012)  
Target
Name:
Insulin-like growth factor 1 receptor
Synonyms:
CD_antigen=CD221 IGF1R Insulin-like growth factor 1 receptor (IGF1R) Insulin-like growth factor 1 receptor alpha chain Insulin-like growth factor I receptor | Insulin-like growth factor receptor (IGFR)
Type:
Protein
Mol. Mass.:
154776.79
Organism:
Homo sapiens (Human)
Description:
P08069
Residue:
1367
  
Inhibitor
Name:
BDBM50382663
Synonyms:
CHEMBL2023553
Type:
Small organic molecule
Emp. Form.:
C27H33N5O4
Mol. Mass.:
491.582
SMILES:
COc1cc(Nc2nccc(n2)N2CCC[C@@H](C2)C(=O)N[C@H](C)c2ccccc2)cc(OC)c1OC
: