Target
Carbonic anhydrase 1
Ligand
BDBM50382720
Substrate
Meas. Tech.
ChEMBL_817309 (CHEMBL2025934)
Ki
40±n/a nM
Citation
 Carta, FAggarwal, MMaresca, AScozzafava, AMcKenna, RMasini, ESupuran, CT Dithiocarbamates strongly inhibit carbonic anhydrases and show antiglaucoma action in vivo. J Med Chem 55:1721-30 (2012)  
Target
Name:
Carbonic anhydrase 1
Synonyms:
CA-I CAB Carbonate dehydratase I Carbonic anhydrase 1 (CA I) Carbonic anhydrase 1 (Recombinant CA I) Carbonic anhydrase B Carbonic anhydrase I (CA I) Carbonic anhydrase I (CAI) Carbonic anhydrase isoenzyme I (hCA I) | hCA
Type:
Enzyme
Mol. Mass.:
28873.37
Organism:
Homo sapiens (Human)
Description:
P00915
Residue:
261
  
Inhibitor
Name:
BDBM50382720
Synonyms:
CHEMBL2023725
Type:
Small organic molecule
Emp. Form.:
C8H8NS2
Mol. Mass.:
182.286
SMILES:
CN(C([S-])=S)c1ccccc1
: