Target
Epidermal growth factor receptor
Ligand
BDBM50383049
Substrate
Meas. Tech.
ChEMBL_818652 (CHEMBL2033041)
IC50
0.23±n/a nM
Citation
 Carmi, CGalvani, EVacondio, FRivara, SLodola, ARusso, SAiello, SBordi, FCostantino, GCavazzoni, AAlfieri, RRArdizzoni, APetronini, PGMor, M Irreversible inhibition of epidermal growth factor receptor activity by 3-aminopropanamides. J Med Chem 55:2251-64 (2012)  
Target
Name:
Epidermal growth factor receptor
Synonyms:
EGF Receptor Substrate EGFR_HUMAN ERBB1 Epidermal Growth Factor Receptor erbB-1 Epidermal growth factor receptor (EGFR) HER1 Proto-oncogene c-ErbB-1 Tyrosine-Protein Kinase ErbB-1
Type:
Receptor Kinase Domain
Mol. Mass.:
134279.59
Organism:
Homo sapiens (Human)
Description:
P00533
Residue:
1210
  
Inhibitor
Name:
BDBM50383049
Synonyms:
CHEMBL2031300
Type:
Small organic molecule
Emp. Form.:
C22H25BrN6O
Mol. Mass.:
469.378
SMILES:
CN1CCN(CCC(=O)Nc2ccc3ncnc(Nc4cccc(Br)c4)c3c2)CC1
: