Target
Epidermal growth factor receptor
Ligand
BDBM50383284
Substrate
Meas. Tech.
ChEMBL_819567 (CHEMBL2033651)
IC50
0.41±n/a nM
Citation
 Chang, SZhang, LXu, SLuo, JLu, XZhang, ZXu, TLiu, YTu, ZXu, YRen, XGeng, MDing, JPei, DDing, K Design, synthesis, and biological evaluation of novel conformationally constrained inhibitors targeting epidermal growth factor receptor threonine7¿°¿ methionine7¿° mutant. J Med Chem 55:2711-23 (2012)  
Target
Name:
Epidermal growth factor receptor
Synonyms:
EGF Receptor Substrate EGFR_HUMAN ERBB1 Epidermal Growth Factor Receptor erbB-1 Epidermal growth factor receptor (EGFR) HER1 Proto-oncogene c-ErbB-1 Tyrosine-Protein Kinase ErbB-1
Type:
Receptor Kinase Domain
Mol. Mass.:
134279.59
Organism:
Homo sapiens (Human)
Description:
P00533
Residue:
1210
  
Inhibitor
Name:
BDBM50383284
Synonyms:
CHEMBL2029429
Type:
Small organic molecule
Emp. Form.:
C28H32N8O3
Mol. Mass.:
528.6055
SMILES:
COc1cc(Nc2ncc3CN(C)C(=O)N(c4cccc(NC(=O)C=C)c4)c3n2)ccc1N1CCN(C)CC1
: