Target
Epidermal growth factor receptor
Ligand
BDBM50383286
Substrate
Meas. Tech.
ChEMBL_819567 (CHEMBL2033651)
IC50
8.81±n/a nM
Citation
 Chang, SZhang, LXu, SLuo, JLu, XZhang, ZXu, TLiu, YTu, ZXu, YRen, XGeng, MDing, JPei, DDing, K Design, synthesis, and biological evaluation of novel conformationally constrained inhibitors targeting epidermal growth factor receptor threonine7¿°¿ methionine7¿° mutant. J Med Chem 55:2711-23 (2012)  
Target
Name:
Epidermal growth factor receptor
Synonyms:
EGF Receptor Substrate EGFR_HUMAN ERBB1 Epidermal Growth Factor Receptor erbB-1 Epidermal growth factor receptor (EGFR) HER1 Proto-oncogene c-ErbB-1 Tyrosine-Protein Kinase ErbB-1
Type:
Receptor Kinase Domain
Mol. Mass.:
134279.59
Organism:
Homo sapiens (Human)
Description:
P00533
Residue:
1210
  
Inhibitor
Name:
BDBM50383286
Synonyms:
CHEMBL2029431
Type:
Small organic molecule
Emp. Form.:
C30H36N8O3
Mol. Mass.:
556.6586
SMILES:
CC(C)Oc1cc(ccc1Nc1ncc2CN(C)C(=O)N(c3cccc(NC(=O)C=C)c3)c2n1)N1CCN(C)CC1
: