Target
Acetyl-CoA carboxylase 1
Ligand
BDBM50383747
Substrate
Meas. Tech.
ChEMBL_819277 (CHEMBL2032634)
IC50
290±n/a nM
Citation
 Kamata, MYamashita, TKina, AFunata, MMizukami, ASasaki, MTani, AFunami, MAmano, NFukatsu, K Design, synthesis, and structure-activity relationships of novel spiro-piperidines as acetyl-CoA carboxylase inhibitors. Bioorg Med Chem Lett 22:3643-7 (2012)  
Target
Name:
Acetyl-CoA carboxylase 1
Synonyms:
ACAC ACACA_HUMAN ACC1 Acetyl-CoA carboxylase 1 | Acetyl-CoA carboxylase 1 (ACC1)
Type:
Protein
Mol. Mass.:
265543.22
Organism:
Homo sapiens (Human)
Description:
Q13085
Residue:
2346
  
Inhibitor
Name:
BDBM50383747
Synonyms:
CHEMBL2030408
Type:
Small organic molecule
Emp. Form.:
C24H29N5O5S
Mol. Mass.:
499.583
SMILES:
CCN1C(=O)OC2(CCCN(C2)C2CCN(CC2)C(=O)c2c(NC(N)=O)sc3ccccc23)C1=O
: