Target
Tyrosine-protein kinase receptor UFO
Ligand
BDBM50384593
Substrate
Meas. Tech.
ChEMBL_820660 (CHEMBL2037931)
IC50
370±n/a nM
Citation
 Liu, JYang, CSimpson, CDeryckere, DVan Deusen, AMiley, MJKireev, DNorris-Drouin, JSather, SHunter, DKorboukh, VKPatel, HSJanzen, WPMachius, MJohnson, GLEarp, HSGraham, DKFrye, SVWang, X Discovery of Novel Small Molecule Mer Kinase Inhibitors for the Treatment of Pediatric Acute Lymphoblastic Leukemia. ACS Med Chem Lett 3:129-134 (2012)  
Target
Name:
Tyrosine-protein kinase receptor UFO
Synonyms:
AXL TEL/AXL UFO | UFO_HUMAN
Type:
Enzyme
Mol. Mass.:
98316.97
Organism:
Homo sapiens (Human)
Description:
P30530
Residue:
894
  
Inhibitor
Name:
BDBM50384593
Synonyms:
CHEMBL2036629
Type:
Small organic molecule
Emp. Form.:
C19H24N6
Mol. Mass.:
336.4341
SMILES:
CNc1ncc2c(nn(C[C@@H]3CC[C@H](N)CC3)c2n1)-c1ccccc1
: