Target
Tyrosine-protein kinase Mer
Ligand
BDBM50384593
Substrate
Meas. Tech.
ChEMBL_820659 (CHEMBL2037930)
IC50
180±n/a nM
Citation
 Liu, JYang, CSimpson, CDeryckere, DVan Deusen, AMiley, MJKireev, DNorris-Drouin, JSather, SHunter, DKorboukh, VKPatel, HSJanzen, WPMachius, MJohnson, GLEarp, HSGraham, DKFrye, SVWang, X Discovery of Novel Small Molecule Mer Kinase Inhibitors for the Treatment of Pediatric Acute Lymphoblastic Leukemia. ACS Med Chem Lett 3:129-134 (2012)  
Target
Name:
Tyrosine-protein kinase Mer
Synonyms:
MER MERTK Proto-oncogene c-Mer Receptor tyrosine kinase MerTK | Tyrosine-protein kinase Mer
Type:
PROTEIN
Mol. Mass.:
110234.77
Organism:
Homo sapiens (Human)
Description:
ChEMBL_1498723
Residue:
999
  
Inhibitor
Name:
BDBM50384593
Synonyms:
CHEMBL2036629
Type:
Small organic molecule
Emp. Form.:
C19H24N6
Mol. Mass.:
336.4341
SMILES:
CNc1ncc2c(nn(C[C@@H]3CC[C@H](N)CC3)c2n1)-c1ccccc1
: