Target
Glycylpeptide N-tetradecanoyltransferase 1
Ligand
BDBM50384920
Substrate
Meas. Tech.
ChEMBL_820572 (CHEMBL2040309)
Ki
47600±n/a nM
Citation
 Goncalves, VBrannigan, JAWhalley, DAnsell, KHSaxty, BHolder, AAWilkinson, AJTate, EWLeatherbarrow, RJ Discovery of Plasmodium vivax N-myristoyltransferase inhibitors: screening, synthesis, and structural characterization of their binding mode. J Med Chem 55:3578-82 (2012)  
Target
Name:
Glycylpeptide N-tetradecanoyltransferase 1
Synonyms:
Myristoyl-CoA:protein N-myristoyltransferase (Nmt) NMT NMT1_HUMAN Peptide N-myristoyltransferase 1
Type:
Enzyme
Mol. Mass.:
56814.10
Organism:
Homo sapiens (Human)
Description:
P30419
Residue:
496
  
Inhibitor
Name:
BDBM50384920
Synonyms:
CHEMBL2036508
Type:
Small organic molecule
Emp. Form.:
C19H24N2OS
Mol. Mass.:
328.472
SMILES:
CCCCc1c(C)nc2ccc(OC)cc2c1SCCCC#N
: