Target
Glycylpeptide N-tetradecanoyltransferase 2
Ligand
BDBM50384920
Substrate
Meas. Tech.
ChEMBL_820573 (CHEMBL2040310)
Ki
46060±n/a nM
Citation
 Goncalves, VBrannigan, JAWhalley, DAnsell, KHSaxty, BHolder, AAWilkinson, AJTate, EWLeatherbarrow, RJ Discovery of Plasmodium vivax N-myristoyltransferase inhibitors: screening, synthesis, and structural characterization of their binding mode. J Med Chem 55:3578-82 (2012)  
Target
Name:
Glycylpeptide N-tetradecanoyltransferase 2
Synonyms:
Glycylpeptide N-tetradecanoyltransferase 2 NMT 2 NMT2_HUMAN Type II N-myristoyltransferase
Type:
PROTEIN
Mol. Mass.:
56986.61
Organism:
Homo sapiens (Human)
Description:
ChEMBL_1435042
Residue:
498
  
Inhibitor
Name:
BDBM50384920
Synonyms:
CHEMBL2036508
Type:
Small organic molecule
Emp. Form.:
C19H24N2OS
Mol. Mass.:
328.472
SMILES:
CCCCc1c(C)nc2ccc(OC)cc2c1SCCCC#N
: