Target
Cyclin-dependent kinase 5 activator 1
Ligand
BDBM50385580
Substrate
Meas. Tech.
ChEMBL_824954 (CHEMBL2045473)
IC50
4000±n/a nM
Citation
 Deslandes, SLamoral-Theys, DFrongia, CChassaing, SBruyère, CLozach, OMeijer, LDucommun, BKiss, RDelfourne, E Synthesis and biological evaluation of analogs of the marine alkaloids granulatimide and isogranulatimide. Eur J Med Chem 54:626-36 (2012)  
Target
Name:
Cyclin-dependent kinase 5 activator 1
Synonyms:
CDK5/p35 Cyclin-dependent kinase 5 regulatory subunit 1 | Cyclin-dependent kinase 5/CDK5 activator 1
Type:
Protein Complex
Mol. Mass.:
Description:
Components:
This complex has 2 components.
Component 1
Name:
Cyclin-dependent kinase 5
Synonyms:
CDK5 CDKN5 Cyclin-dependent kinase 5 (CDK5/ p25) Cyclin-dependent-like kinase 5 PSSALRE Tau protein kinase II catalytic subunit
Type:
Enzyme Subunit
Mol. Mass.:
33308.61
Organism:
Homo sapiens (Human)
Description:
Residue:
292
  
Component 2
Name:
Cyclin-dependent kinase 5 activator 1
Synonyms:
CD5R1_HUMAN CDK5R1 Cyclin-dependent kinase 5 (CDK5/p25) NCK5A p35
Type:
Enzyme Subunit
Mol. Mass.:
34077.43
Organism:
Homo sapiens (Human)
Description:
Q15078
Residue:
307
  
Inhibitor
Name:
BDBM50385580
Synonyms:
CHEMBL2041914
Type:
Small organic molecule
Emp. Form.:
C15H8N4O2
Mol. Mass.:
276.2496
SMILES:
O=C1NC(=O)c2c1c1ccnn1c1[nH]c3ccccc3c21
: