Target
Dual specificity protein kinase CLK1
Ligand
BDBM50216159
Substrate
Meas. Tech.
ChEMBL_824956 (CHEMBL2045475)
IC50
260±n/a nM
Citation
 Deslandes, SLamoral-Theys, DFrongia, CChassaing, SBruyère, CLozach, OMeijer, LDucommun, BKiss, RDelfourne, E Synthesis and biological evaluation of analogs of the marine alkaloids granulatimide and isogranulatimide. Eur J Med Chem 54:626-36 (2012)  
Target
Name:
Dual specificity protein kinase CLK1
Synonyms:
CDC-like kinase 1 Clk Protein kinase STY | Sty
Type:
PROTEIN
Mol. Mass.:
57124.52
Organism:
Mus musculus
Description:
ChEMBL_1502245
Residue:
483
  
Inhibitor
Name:
BDBM50216159
Synonyms:
5-hydroxy-pyrrolo[3',4':5,6]indolizino[8,7-b]indole-1,3-(2H,8H)-dione | CHEMBL239698
Type:
Small organic molecule
Emp. Form.:
C16H9N3O3
Mol. Mass.:
291.261
SMILES:
Oc1ccc2[nH]c3c4cccn4c4C(=O)NC(=O)c4c3c2c1
: