Target
Cytochrome P450 3A4
Ligand
BDBM50106864
Substrate
Meas. Tech.
ChEMBL_825129 (CHEMBL2043505)
Ki
80±n/a nM
Citation
 Chang, MLee, SHKim, HJKoh, JSKim, A Preclinical metabolism of LB42908, a novel farnesyl transferase inhibitor, and its effects on the cytochrome P450 isozyme activities. Bioorg Med Chem Lett 22:3067-71 (2012)  
Target
Name:
Cytochrome P450 3A4
Synonyms:
Albendazole monooxygenase CP3A4_HUMAN CYP3A4 CYPIIIA4 Cytochrome P450 3A4 (CYP3A4) Nifedipine oxidase Taurochenodeoxycholate 6-alpha-hydroxylase
Type:
Enzyme
Mol. Mass.:
57349.57
Organism:
Homo sapiens (Human)
Description:
Residue:
503
  
Inhibitor
Name:
BDBM50106864
Synonyms:
(1-((1-(benzo[d][1,3]dioxol-5-ylmethyl)-1H-imidazol-5-yl)methyl)-4-(naphthalen-1-yl)-1H-pyrrol-3-yl)(4-methylpiperazin-1-yl)methanone [1-(3-Benzo[1,3]dioxol-5-ylmethyl-3H-imidazol-4-ylmethyl)-4-naphthalen-1-yl-1H-pyrrol-3-yl]-(4-methyl-piperazin-1-yl)-methanone
Type:
Small organic molecule
Emp. Form.:
C32H31N5O3
Mol. Mass.:
533.6202
SMILES:
CN1CCN(CC1)C(=O)c1cn(Cc2cncn2Cc2ccc3OCOc3c2)cc1-c1cccc2ccccc12
: