Target
Amine oxidase [flavin-containing] A
Ligand
BDBM50386547
Substrate
Meas. Tech.
ChEMBL_826182 (CHEMBL2049623)
Ki
16982.44±n/a nM
Citation
 Pettersson, FSvensson, PWaters, SWaters, NSonesson, C Synthesis and evaluation of a set of para-substituted 4-phenylpiperidines and 4-phenylpiperazines as monoamine oxidase (MAO) inhibitors. J Med Chem 55:3242-9 (2012)  
Target
Name:
Amine oxidase [flavin-containing] A
Synonyms:
AOFA_RAT Amine oxidase [flavin-containing] A Monoamine Oxidase Type A (MAO-A) Monoamine oxidase A (MAO-A) Monoamine oxidase type A (MAOA)
Type:
Enzyme
Mol. Mass.:
59515.21
Organism:
Rattus norvegicus (rat)
Description:
Residue:
526
  
Inhibitor
Name:
BDBM50386547
Synonyms:
CHEMBL2048234
Type:
Small organic molecule
Emp. Form.:
C14H19F3N2O3S
Mol. Mass.:
352.372
SMILES:
CCCN1CCN(CC1)c1ccc(OS(=O)(=O)C(F)(F)F)cc1
: