Target
Carbonic anhydrase 9
Ligand
BDBM50387159
Substrate
Meas. Tech.
ChEMBL_827864 (CHEMBL2051273)
Ki
15±n/a nM
Citation
 Winum, JYCarta, FWard, CMullen, PHarrison, DLangdon, SPCecchi, AScozzafava, AKunkler, ISupuran, CT Ureido-substituted sulfamates show potent carbonic anhydrase IX inhibitory and antiproliferative activities against breast cancer cell lines. Bioorg Med Chem Lett 22:4681-5 (2012)  
Target
Name:
Carbonic anhydrase 9
Synonyms:
CA-IX CAH9_HUMAN Carbonic anhydrase 9 (CA IX) Carbonic anhydrase 9 precursor Carbonic anhydrase IX (CAIX) Carbonic anhydrases; II & IX MN RCC-associated antigen G250
Type:
Enzyme
Mol. Mass.:
49669.03
Organism:
Homo sapiens (Human)
Description:
Catalytic domain of human cloned isozyme was used in the assay
Residue:
459
  
Inhibitor
Name:
BDBM50387159
Synonyms:
4-ureidophenyl sulfamate ring derivative 3ax | CHEMBL2047840
Type:
Small organic molecule
Emp. Form.:
C19H19N3O4S
Mol. Mass.:
385.437
SMILES:
NS(=O)(=O)Oc1ccc(NC(=O)NCCc2cccc3ccccc23)cc1
: